{"text_format":"3","workbook":"xlsx","n_sheets":3,"sheets":["cstpcd2016收录情况","Sheet2","Sheet3"],"not_rendered":{"external_links":2,"defined_names":1},"read":"whole","date_system":"1900"}

{"sheet":"cstpcd2016收录情况","index":0,"n_rows":948,"n_cols":16,"rows_kept":948}
["刊名","第一作者","第一作者身份","所有作者","通讯作者","第一教师作者","学院","导师","单位","题名","年","卷","期","页码","基金","文献类型"]
["中国矿业大学学报","杨智峰","学生","杨智峰;曾溅辉;冯枭;冯森;张译丹;乔俊程",null,"曾溅辉",{"$f":"VLOOKUP(F2,[1]Sheet1!$B$2:$C$1437,2,FALSE)","v":"地球科学学院"},null,"中国石油大学(北京)","致密砂岩储层小尺度非均质性与石油富集特征","2016","45","01","119-127","国家自然科学基金重点项目(40772088;41172128)","A"]
["地学前缘","陈冬霞","教师","陈冬霞;刘雨晨;庞雄奇;钟大康;孟昊;熊亮",null,"陈冬霞",{"$f":"VLOOKUP(F3,[1]Sheet1!$B$2:$C$1437,2,FALSE)","v":"地球科学学院"},null,"中国石油大学(北京)","川西坳陷须五段陆相页岩层系储层特征及对含气性的控制作用","2016","23","01","174-184","国家重点基础研究发展计划“973”项目(2011CB201102);国家自然科学基金项目(41472110)","A"]
["石油勘探与开发","周正龙","学生","周正龙;王贵文;冉冶;赖锦;崔玉峰;赵显令",null,"王贵文",{"$f":"VLOOKUP(F4,[1]Sheet1!$B$2:$C$1437,2,FALSE)","v":"地球科学学院"},null,"中国石油大学(北京)","致密油储集层岩性岩相测井识别方法——以鄂尔多斯盆地合水地区三叠系延长组7段为例","2016","43","01","61-68,83","国家科技重大专项(2016ZX05019005-006);国家自然科学基金(41472115)","A"]
["地球科学与环境学报","张汪明","学生","张汪明; 曾溅辉; 李飞; 赵芸黎; 张译丹",null,"曾溅辉",{"$f":"VLOOKUP(F5,[1]Sheet1!$B$2:$C$1437,2,FALSE)","v":"地球科学学院"},null,"中国石油大学(北京)","柴西地区古近系和新近系地层水化学特征及其成因","2016","38","04","558-568","中国地质调查局地质大调查项目(12120114009601)","A"]
["中国地质","冉冶","学生","冉冶;王贵文;周正龙;赖锦;代全齐;陈晶;范旭强;王抒忱",null,"王贵文",{"$f":"VLOOKUP(F6,[1]Sheet1!$B$2:$C$1437,2,FALSE)","v":"地球科学学院"},null,"中国石油大学(北京)","鄂尔多斯盆地合水地区长7致密油岩性岩相类型识别及其应用","2016","43","04","1331-1340","国家十二五科技重大专项(2011ZX05020-008)和国家自然科学基金(41472115)联合资助.Supported by National Key Science and Technology Special Projects of the Twelfth Five Year (2011ZX05020-008) and National Natural Science Foundation (No.41472115).","A"]
["吉林大学学报（地球科学版）","陈冬霞","教师","陈冬霞; 庞雄奇; 杨克明; 祝渭平; 严青霞",null,"陈冬霞",{"$f":"VLOOKUP(F7,[1]Sheet1!$B$2:$C$1437,2,FALSE)","v":"地球科学学院"},null,"中国石油大学(北京)","川西坳陷深层叠复连续型致密砂岩气藏成因及形成过程","2016","46","06","1611-1623","国家“973”计划项目（2011CB201102）；国家自然科学基金项目（41472110）Supported by Key Basic Research Program of China （2011CB201102）and National Natural Science Foundation of China （41472110）","A"]
["现代地质","李飞","学生","李飞;李少龙;曾溅辉;刘井旺;刘佳;葛黛薇;王阳;穆永晶",null,"曾溅辉",{"$f":"VLOOKUP(F8,[1]Sheet1!$B$2:$C$1437,2,FALSE)","v":"地球科学学院"},null,"中国石油大学(北京)","霸县凹陷牛驼镇凸起潜山内幕古流体和现今流体特征研究","2016","30","05","1115-1123,1133","国家科技重大专项(2011ZX05006-001);中国石油华北油田科技攻关项目(HBYT-YJY-2013-JS-223).","A"]
["东北石油大学学报","李飞","学生","李飞;曾溅辉;金凤鸣;刘井旺;赵智鹏;刘佳;葛黛薇;吴晨林",null,"曾溅辉",{"$f":"VLOOKUP(F9,[1]Sheet1!$B$2:$C$1437,2,FALSE)","v":"地球科学学院"},null,"中国石油大学(北京)","华北牛驼镇凸起潜山方解石脉体特征及流体响应","2016","40","06","44-52","国家科技重大专项(2011ZX05006-001);中国石油华北油田科技攻关项目(HBYT-YJY-2013-JS-223)","A"]
["沉积学报","冉冶","学生","冉冶;王贵文;赖锦;周正龙;崔玉峰;代全齐;陈晶;王抒忱",null,"王贵文",{"$f":"VLOOKUP(F10,[1]Sheet1!$B$2:$C$1437,2,FALSE)","v":"地球科学学院"},null,"中国石油大学(北京)","利用测井交会图法定量表征致密油储层成岩相——以鄂尔多斯盆地华池地区长7致密油储层为例","2016","34","04","694-706","国家科技重大专项(2011ZX05020-008);国家自然科学基金(41472115);China National Science and Technology Major Project,No.2011ZX05020-008;National Natural Science Foundation of China,No.41472115","A"]
["中南大学学报（自然科学版）","柴毓","学生","柴毓; 王贵文; 张晓涛;冉冶",null,"王贵文",{"$f":"VLOOKUP(F11,[1]Sheet1!$B$2:$C$1437,2,FALSE)","v":"地球科学学院"},null,"中国石油大学","川中安岳地区须二段致密砂岩储层孔隙结构特征及测井识别","2016","47","03","819-828","国家科技重大专项(2011ZX05020-008);中石油创新基金资助项目(2013D-5006-030) (Project(2011ZX05020-008)supported by National Major Scientific Research Program;Project(2013D-5006-030) supported by the Innovation Fund of China National Petroleum Corporation","A"]
["中国科学（地球科学）","宋到福","教师","宋到福; 王铁冠; 李美俊",null,"宋到福","地球科学学院",null,"中国石油大学(北京)","塔中地区中深1和中深1C井盐下寒武系油气地球化学特征及其油气源判识","2016","46","01","107-117","中国石油大学(北京)科研基金项目(编号:2462015YQ0101)资助","A"]
["中国沼气","曾勇","教师","曾勇;江皓;李江;聂红;丁江涛;周红军",null,"曾勇","地球科学学院",null,"中国石油大学(北京)","木质纤维预处理方法及基质的变化与检测","2016","34","01","50-57","国家高技术研究发展计划“863”计划(2012AA063507)","R"]
["化工进展","王伟","学生","王伟; 闫秀懿; 张磊; 周菁辉",null,"闫秀懿","地球科学学院",null,"中国石油大学(北京)","木质纤维素生物质水热液化的研究进展","2016","NULL","02","453-462","国家自然科学基金青年基金（51108458）及教育部留学回国人员科研启动基金（2011-1139）项目。","R"]
["地质通报","张敏","学生","张敏; 张枝焕; 欧光习; 尚长健; 黎琼",null,"张枝焕","地球科学学院",null,"中国石油大学(北京)","柴达木盆地西部古近系干柴沟组页岩储层特征","2016","35","02","329-338","中国地质调查局项目（编号1212011221045、12120113040000）","A"]
["天然气地球科学","杨福林","学生","杨福林; 王铁冠; 李美俊",null,"王铁冠","地球科学学院",null,"中国石油大学(北京)","塔里木台盆区寒武系烃源岩地球化学特征","2016","27","05","861-872","国家自然科学基金(编号:41272158)资助.","A"]
["微生物学通报","万云洋","教师","万云洋; 赵国屏",null,"万云洋","地球科学学院",null,"中国石油大学(北京)","原核微生物之杆菌和小杆菌","2016","43","06","1315-1332","National Natural Science Foundation of China (No.41373086,41373126);Beijing Higher Education Young Elite Teacher Project (No.YETP0670);Beijing Nova Program (No.XXJC201605)国家自然科学基金项目(No.41373086,41373126);北京市青年英才计划(No.YETP0670);北京","R"]
["西安石油大学学报（自然科学版）","杜治利","学生","杜治利; 刘洪军; 张枝焕",null,"张枝焕","地球科学学院",null,"中国石油大学(北京)","准噶尔盆地南缘中二叠统烃源岩地球化学特征","2016","31","03","1-7","国家科技重大专项项目(编号:2011ZX05002)","A"]
["高校地质学报","杨禄","学生","杨禄; 李美俊; 张春明",null,"李美俊","地球科学学院",null,"中国石油大学(北京)","生物降解作用对大宛齐油田库车组原油轻烃参数的影响","2016","22","03","549-554","国家自然科学基金项目（41272158；41172136）；油气资源与探测国家重点实验室项目（PRP/indep-2-1302）；油气资源与探测国家重点实验室开放基金（PRP/open-1503）资助","A"]
["天然气地球科学","杨禄","学生","杨禄; 张春明; 李美俊; 卞龙; 余兴",null,"李美俊","地球科学学院",null,"中国石油大学(北京)","Mango轻烃参数在塔里木盆地大宛齐油田中的应用","2016","27","08","1524-1531","国家自然科学基金项目(编号:41272158;41172136);油气资源与探测国家重点实验室项目(编号:PRP/indep-2-1302)联合资助.","A"]
["微生物学杂志","万云洋","教师","万云洋; 费佳佳; 赵国屏",null,"万云洋","地球科学学院",null,"中国石油大学(北京)","原核微生物之竿菌","2016","36","03","73-79","国家自然科学基金项目(41373086,41373126);北京市青年英才计划(YETP0670);北京市科技新星交叉合作课题(XXJC201605)","R"]
["微生物学杂志","万云洋","教师","万云洋; 赵国屏",null,"万云洋","地球科学学院",null,"中国石油大学(北京)","原核微生物之菌和微菌","2016","36","04","71-75","国家自然科学基金项目(41373086,41373126);国家重大科技专项(2016ZX05050011,2016ZX05040002-006);北京市青年英才计划(YETP0670);北京市科技新星交叉合作课题(XXJC201605)","R"]
["沉积学报","杨程宇","学生","杨程宇; 李美俊; 倪智勇; 杨福林; 陈昊卫",null,"李美俊","地球科学学院",null,"中国石油大学(北京)","塔里木盆地西北缘玉尔吐斯组硅质岩成因及石油地质意义","2016","34","04","653-661","国家科技重大专项(2011ZX05008-003,2011ZX05008-003-20);China National Science and Technology Major Project,No.2011ZX05008-003,2011ZX05008-003-20","A"]
["沉积学报","宋爽","学生","宋爽;朱筱敏;于福生;葛家旺;史亚会;贺敬聪;袁立忠;刘军",null,"朱筱敏","地球科学学院",null,"中国石油大学(北京)","珠江口盆地长昌—鹤山凹陷古近系沉积—构造耦合关系","2016","34","02","222-235","国家油气重大专项课题(2011ZX05025-005,2011ZX05001-002);国家自然科学基金项目(41272133);National Major Projects of Oil and Gas, No.2011ZX05025-005, 2011ZX05001-002;National Natural Science Foundation of China, No.41272133","A"]
["天然气地球科学","赵建华","学生","赵建华;金之钧;金振奎;温馨;耿一凯;颜彩娜",null,"金振奎","地球科学学院",null,"中国石油大学(北京)","四川盆地五峰组—龙马溪组含气页岩中石英成因研究","2016","27","02","377-386","中国石化科技攻关项目“川东地区龙马溪组页岩气富集规律与分布预测”(编号:G5800-14-ZS-KJB158)资助.","A"]
["石油学报","赵建华","学生","赵建华;金之钧;金振奎;温馨;耿一凯;颜彩娜;聂海宽",null,"金振奎","地球科学学院",null,"中国石油大学(北京)","四川盆地五峰组—龙马溪组页岩岩相类型与沉积环境","2016","37","05","572-586","中国博士后科学基金《富有机质页岩中自生石英成因机制及对页岩气勘探的意义》(No.2016M591350)、国家自然科学基金项目《高热演化条件下页岩气聚集机理和评价方法研究》(No.41202103)和中国石油化工股份有限公司科技攻关项目《川东地区龙马溪组页岩气富集规律与分布预测 ","A"]
["古地理学报","王星星","学生","王星星;朱筱敏;宋爽;吴陈冰洁;贺敬聪;曹刚",null,"朱筱敏","地球科学学院",null,"中国石油大学(北京)","渤海湾盆地车西洼陷陡坡带古近系沙河街组沙三下段“源-汇”系统","2016","18","01","65-79","国家油气重大专项子课题(编号:2011ZX05009-002,2012ZX05001-002)、国家自然科学基金项目(编号:41272133)、国家自然科学基金青年科学基金项目(编号:41202107)联合资助.[Co-funded by the subproject of National Significant Petroleum Special Projects of China (No.20","A"]
["古地理学报","孟昊","学生","孟昊;钟大康;李超;周军良;秦刚;刘云龙;刘珂茹",null,"钟大康","地球科学学院",null,"中国石油大学(北京)","渤海湾盆地渤中坳陷渤中25－1油田古近系沙河街组沙二段沉积相及演化","2016","18","02","161-172","国家自然科学基金项目（编号41302108）、国家“973”项目（编号2011CB201104）、中国石油大学（北京）科研基金（编号KYJJ2012－01－18）共同资助。［Co-funded by the National Natural Science Foundation of China（Grant No.41302108），the National Program on Key","A"]
["岩石学报","杨克基","学生","杨克基;漆家福;余一欣;马宝军;平英奇;徐长贵",null,"漆家福","地球科学学院",null,"中国石油大学(北京)","辽中凹陷反转构造及其对郯庐断裂带走滑活动的响应","2016","32","04","1182-1196","本文受国家自然科学基金项目(40372072、41572202)资助.","A"]
["中国矿业大学学报","毛亚昆","学生","毛亚昆;钟大康;李勇;闫婷;王点;刘云龙;路昭",null,"钟大康","地球科学学院",null,"中国石油大学(北京)","库车前陆冲断带白垩系中-深层砂岩储层孔渗关系及控制因素","2016","45","06","1184-1192","国家科技重大专项(2011ZX05003-004);国家重点基础研究发展计划(973)项目(2011CB201104);国家自然科学基金项目(41302108)","A"]
["天然气地球科学","杨宪彰","学生","杨宪彰;毛亚昆;钟大康;李勇;能源;孙海涛;刘云龙",null,"钟大康","地球科学学院",null,"中国石油大学(北京)","构造挤压对砂岩储层垂向分布差异的控制——以库车前陆冲断带白垩系巴什基奇克组为例","2016","27","04","591-599","国家科技重大专项(编号:2011ZX05003-004);国家重点基础研究发展计划(“973”)项目(编号:2011CB201104;2011CB201106);国家自然科学基金项目(编号:41302108)联合资助.","A"]
["古地理学报","金振奎","教师","金振奎; 石良; 闫伟; 朱小二; 彭飚",null,"金振奎","地球科学学院",null,"中国石油大学(北京)","沉积和成岩因素对碎屑岩储集层质量贡献率的定量分析方法--单因素比较法","2016","18","04","535-544","国家重大科技专项“油气勘探领域储集层地质与油气评价”（编号2009ZX05009－002）项目资助。［Financially suppored by National Science and Technology Major Projects of “Reservoir geology and oil and gas evaluation in the field of oil and gas exploration”","A"]
["地球科学与环境学报","苗钱友","学生","苗钱友;朱筱敏;姜振学;李卓;陈磊;张昆;原园",null,"朱筱敏","地球科学学院",null,"中国石油大学(北京)","传统油气地质理论的突破与创新及非常规油气资源潜力","2016","38","04","505-516","国家重点基础研究发展计划(“九七三”计划)项目(2014CB239105)；国家自然科学基金项目(41472112)","A"]
["地球科学与环境学报","孙晶","教师","孙晶; 谢庆宾",null,"孙晶","地球科学学院",null,"中国石油大学(北京)","西伯利亚雅库特地区岩石圈地幔特征","2016","38","04","517-526","中国石油大学(北京)引进人才科研启动基金项目(2462015YJRC021)","A"]
["石油实验地质","赵建华","学生","赵建华;金之钧;金振奎;杜伟;温馨;耿一凯",null,"金振奎","地球科学学院",null,"中国石油大学(北京)","岩石学方法区分页岩中有机质类型","2016","38","04","514-520,527","中国博士后科学基金（2016M591350）资助。","A"]
["天然气地球科学","杨克基","学生","杨克基;漆家福;余一欣;平英奇;高强;吕继",null,"漆家福","地球科学学院",null,"中国石油大学(北京)","辽东湾地区潜山差异演化及成藏条件分析","2016","27","06","1014-1024","国家自然科学基金项目(编号:41472117;91114202);中国石油大学(北京)基金项目(编号:KYJJ2012-01-11)联合资助.","A"]
["岩性油气藏","陈贺贺","学生","陈贺贺; 朱筱敏; 陈纯芳; 尹伟",null,"朱筱敏","地球科学学院",null,"中国石油大学(北京)","鄂尔多斯盆地彬长区块延长组生储盖组合与油气富集特征","2016","28","02","56-63","国家油气重大专项“中西部重点碎屑岩领域油气富集规律与分布预测”(编号:2011ZX05002-006)和“岩性地层油气藏沉积体系、储层形成机理与分布研究”(编号:2011ZX05001-002-01)联合资助","A"]
["石油地球物理勘探","杨克基","学生","杨克基;漆家福;余一欣;平英奇;张晨;高强",null,"漆家福","地球科学学院",null,"中国石油大学(北京)","渤海湾地区断层相关褶皱及其油气地质意义","2016","51","03","625-636","本项研究受国家自然科学基金项目(41472117,91114202)及中国石油大学(北京)基金项目(KYJJ2012-01-11)联合资助.","A"]
["天然气地球科学","孟昊","学生","孟昊;任影;钟大康;高崇龙;高宙;王点;姜杨锦丰;李谨杰",null,"钟大康","地球科学学院",null,"中国石油大学(北京)","四川盆地东部寒武系龙王庙组地球化学特征及其古环境意义","2016","27","07","1299-1311","国家自然科学基金项目(编号:41472094;4302108)资助．","A"]
["石油学报","高白水","学生","高白水; 金振奎; 朱小二; 魏凯; 伊硕",null,"金振奎","地球科学学院",null,"中国石油大学(北京)","哈萨克斯坦扎纳诺尔油田石炭系碳酸盐岩浅滩沉积模式及诸层质量差异机理","2016","37","07","867-877","国家重点基础研究发展计划(973)项目(2006CB202300)资助.","A"]
["地质学报","赖锦","教师","赖锦;王贵文;王迪;周正龙;冉冶;陈晶;王抒忱;张晓涛",null,"赖锦","地球科学学院",null,"中国石油大学(北京)","川中地区上三叠统须家河组成岩层序地层学特征","2016","90","06","1236-1252","本文为国家大型油气田及煤层气开发科技重大专项“低渗透碎屑岩储层品质与岩石物理相测井评价方法”(编号2011ZX05020-008,2016ZX05019-005-007)、国家自然科学基金项目“致密砂岩储层成岩相测井识别方法研究”(编号41472115)和中国石油集团科技创新基金项目“致密砂砾岩 ","A"]
["岩性油气藏","陈锋","学生","陈锋; 朱筱敏; 葛家旺; 黎明; 吴陈冰洁",null,"朱筱敏","地球科学学院",null,"中国石油大学(北京)","珠江口盆地陆丰南地区文昌组层序地层及沉积体系研究","2016","28","04","67-77,94","国家科技部油气重大专项“岩性地层油气藏沉积体系、储层形成机理与分布研究”(编号:2011ZX05001-002)与国家油气重大专项“海洋深水区油气勘探关键技术”(编号:2011ZX05025-005-02)联合资助","A"]
["地层学杂志","孟昊","学生","孟昊;钟大康;李卓沛;刘云龙;赵靖;杨越东",null,"钟大康","地球科学学院",null,"中国石油大学(北京)","川西坳陷中段上三叠统须家河组须五段层序格架与沉积相","2016","40","03","278-289","国家重点基础研究发展计划(973)项目子课题“中国西部叠合盆地深部有效碎屑岩储层成因机制与发育模式”(No.2011CB201104)资助.","A"]
["石油学报","任影","学生","任影;钟大康;高崇龙;杨雪琪;谢瑞;李卓沛;邓闵心;周勇成",null,"钟大康","地球科学学院",null,"中国石油大学(北京)","川东寒武系龙王庙组白云岩地球化学特征、成因及油气意义","2016","37","09","1102-1115","国家重点基础研究发展计划(973)项目(2011CB201104)和国家自然科学基金项目(No.41472094)资助.","A"]
["古地理学报","朱筱敏","教师","朱筱敏;李顺利;潘荣;谈明轩;陈贺贺;王星星;陈锋;张梦瑜;侯冰洁;董艳蕾",null,"朱筱敏","地球科学学院",null,"中国石油大学(北京)","沉积学研究热点与进展：第32届国际沉积学会议综述","2016","18","05","699-716","国家自然科学基金项目（编号：41272133）资助。［Financially supported by the National Natural Science Fundation of China（No.41272133）］","R"]
["海相油气地质","任影","学生","任影;钟大康;高崇龙;杨雪琪;李海洋;杨强;刘云龙;王玉",null,"钟大康","地球科学学院",null,"中国石油大学,北京","四川盆地东部下寒武统龙王庙组碳、氧同位素组成及古环境意义","2016","21","04","11-20","本文受国家自然科学基金项目“白音查干凹陷下白垩统腾格尔组白云岩成因机理研究”（项目编号41072104）资助","A"]
["天然气地球科学","耿一凯","学生","耿一凯;金振奎;赵建华;温馨;陈俊年;杜伟",null,"金振奎","地球科学学院",null,"中国石油大学(北京)","川东地区龙马溪组页岩黏土矿物组成与成因","2016","27","10","1933-1941","中国博士后科学基金(编号:2016M591350)资助．","A"]
["地球科学-中国地质大学学报","刘强虎","学生"," 刘强虎; 朱筱敏; 李顺利; 李慧勇; 石文龙",null,"朱筱敏","地球科学学院",null,"中国石油大学(北京)","沙垒田凸起前古近系基岩分布及源-汇过程","2016","41","11","1935-1949","国家自然科学基金项目(No.41272133).","A"]
["中国石油大学学报（自然科学版）","鲜本忠","教师","鲜本忠;王璐;刘建平;路智勇;李宇志;牛栓文;朱永飞;洪方浩",null,"鲜本忠","地球科学学院",null,"中国石油大学","东营凹陷东部始新世三角洲供给型重力流沉积特征与模式","2016","40","05","10-21","国家自然科学基金项目(41172104,41272133,41372117);国家油气重大专项(2011ZX05009-002,2011ZX05014-001);中国石油大学(北京)科研基金项目(KYJJ2012-01-06)","A"]
["古地理学报","刘建平","学生","刘建平;鲜本忠;王璐;路智勇;李宇志;刘赛君;蒋健",null,"鲜本忠","地球科学学院",null,"中国石油大学（北京）","渤海湾盆地东营凹陷始新世三角洲供给型重力流地震沉积学研究","2016","18","06","961-975","国家自然科学基金项目（编号41172104，41272133，41372117）、国家科技重大专项（编号2011 ZX05009－002，2011 ZX05014－001）联合资助。［Co-Funded by the National Natural Science Foundation of China （No．41172104，41272133，41372117） and National Science","A"]
["中国地质","苗全芸","学生","苗全芸;漆家福;肖阳;王利爽;曾婷;张洁",null,"漆家福","地球科学学院",null,"中国石油大学","二连盆地乌尼特坳陷伸展构造特征及成盆演化","2016","43","06","2036-2045","国家科技重大专项课题（2011ZX05009-001）、中国石油大学（北京）油气资源与探测国家重点实验室应用基础研究资助课题。","A"]
["新疆石油地质","余海波","学生","余海波;漆家福;杨宪彰;孙统;刘骐峣;曹淑娟",null,"漆家福","地球科学学院",null,"中国石油大学","塔里木盆地库车坳陷中生代原型盆地分析","2016","37","06","644-653,666","国家科技重大专项(2011ZX05003-004)","A"]
["大地构造与成矿学","陈书平","教师","陈书平; 韩煦; 黄新文",null,"陈书平","地球科学学院",null,"中国石油大学(北京)","东濮凹陷古近系伸展褶皱及形成机理","2016","40","05","908-918","国家自然科学基金项目(41172124)资助。","A"]
["沉积学报","谈明轩","学生","谈明轩; 朱筱敏; 耿名扬; 刘常妮",null,"朱筱敏","地球科学学院",null,"中国石油大学(北京)","沉积物重力流流体转化沉积—混合事件层","2016","34","06","1108-1119","国家科技重大专项(2016ZX05001002-006)[National Science and Technology Major Project,No.2016ZX05001002-006]","A"]
["高校地质学报","余海波","学生","余海波;漆家福;杨宪章;刘骐峣;曹淑娟;范绳;孙统;杨向阳",null,"漆家福","地球科学学院",null,"中国石油大学","塔里木盆地库车坳陷中生界构造古地理分析","2016","22","04","657-669","国家重大专项（2011ZX05003-004）的企业配套项目","A"]
["石油地球物理勘探","陈书平","教师","陈书平; 季弘莹; 李伟",null,"陈书平","地球科学学院",null,"中国石油大学(北京)","东濮凹陷铲式正断层回滑构造及油气意义","2016","51","04","831-840","本项研究受国家自然科学基金课题(41172124)资助.","A"]
["石油勘探与开发","朱筱敏","教师","朱筱敏;钟大康;袁选俊;张惠良;朱世发;孙海涛;高志勇;鲜本忠",null,"朱筱敏","地球科学学院",null,"中国石油大学(北京)","中国含油气盆地沉积地质学进展","2016","43","05","820-829","国家自然科学基金项目(41272133);国家科技部油气重大专项(2011ZX05001-002,2011ZX05009-002);国家重点基础研究发展计划(973)项目(2011CB201104)","R"]
["古地理学报","钟大康","教师","钟大康",null,"钟大康","地球科学学院",null,"中国石油大学(北京)","山地蚀源区的沉积类型及其相关概念的系统梳理与厘定","2016","18","03","335-348","国家自然科学基金项目（编号41472094O）部分成果。［Supported by the National Natural Science Foundation of China （No.41472094O）］","R"]
["古地理学报","朱筱敏","教师","朱筱敏;葛家旺;宋爽;汪瑞良;袁立忠;刘军",null,"朱筱敏","地球科学学院",null,"中国石油大学(北京)","南海北部长昌-鹤山凹陷渐新世陆架边缘三角洲-深水扇地震响应及形成条件","2016","18","03","367-380","国家油气重大专项项目（编号2011 ZX05025－005－02）资助。@@@@［Financially supported by National Science and Technology Major Projects of Oil and Gas （No.2011 ZX05025－005－02）］","A"]
["石油与天然气地质","陈石","学生","陈石; 郭召杰; 漆家福;邢向荣",null,"漆家福","地球科学学院",null,"中国石油大学(北京)","准噶尔盆地西北缘三期走滑构造及其油气意义","2016","37","03","322-331","国家自然科学基金项目(41502208).","A"]
["石油与天然气地质","张琴","教师","张琴;朱筱敏;李晨溪;乔李井宇;刘畅;梅啸寒;杜会尧;禄佳景",null,"朱筱敏","地球科学学院",null,"中国石油大学(北京)","渤海湾盆地沾化凹陷沙河街组富有机质页岩孔隙分类及孔径定量表征","2016","37","03","422-432,438","国家自然科学基金项目(41302081);教育部留学回国启动基金项目(ZX20140267).","A"]
["地质科技情报","蔡俊","学生","蔡俊; 吕修祥; 李博媛",null,"吕修祥","地球科学学院",null,"中国石油大学(北京)","横向断层及其控油气作用","2016","35","01","107-113","国家重点基础研究发展规划(\"973\")项目(2012CB214804);国家自然科学基金项目(4137214","A"]
["现代地质","余一欣","教师","余一欣;殷进垠;郑俊章;李锋;陶崇智;徐小龙;吴航",null,"余一欣","地球科学学院",null,"中国石油大学(北京)","中亚北乌斯丘尔特盆地成藏组合划分与资源潜力评价","2016","NULL","01","192-199","国家自然科学基金项目（41472117，41125010）；国家科技重大专项（2011ZX05031-001，2011ZX05029-002，2011ZX 05002-006）","A"]
["地质论评","窦文超","学生","窦文超; 刘洛夫; 吴康军; 徐正建",null,"刘洛夫","地球科学学院",null,"中国石油大学(北京)","基于压汞实验研究低渗储层孔隙结构及其对渗透率的影响——以鄂尔多斯盆地西南部三叠系延长组长7储层为例","2016","62","02","502-512","This paper is financially supported by the National Natural Science Fund Project of China (No.41372143) and the Specialized Research Fund for the Doctoral Program of Higher Education of Chinese Education Ministry (No.20130007110002).本文为国家自然科 ","A"]
["现代地质","王大鹏","学生","王大鹏;白国平;陆红梅;陶崇智;王一帆;张明辉;王文庸;卢小新;高琳;郭栋",null,"白国平","地球科学学院",null,"中国石油大学(北京)","扎格罗斯盆地含油气系统分析与资源潜力评价","2016","30","02","361-372","国家科技重大专项（2011 ZX05031－001－007HZ）。","A"]
["地球科学与环境学报","郭颖","学生","郭颖; 汤良杰; 余腾孝; 李九梅; 岳勇",null,"汤良杰","地球科学学院",null,"中国石油大学(北京)","塔里木盆地玛扎塔格断裂带构造特征及其油气地质意义","2016","38","01","104-114","国家自然科学基金项目(41572105,41172125);国家重点基础研究发展计划(“九七三”计划)项目(2012CB214804,2005CB422107);国家科技重大专项项目(2011ZX05002-003-001);中国石油化工股份有限公司项目(P14131,P11086)","A"]
["油气地质与采收率","贾京坤","学生","贾京坤;尹伟;邱楠生;陈纯芳;周末;缪巍",null,"邱楠生","地球科学学院",null,"中国石油大学(北京)","红河油田延长组长8段油气输导体系及运聚模式","2016","23","02","9-15","国家科技重大专项“中西部重点碎屑岩领域油气富集规律与分布预测”(2011ZX05002-006).","A"]
["工程科学学报","张凯逊","学生","张凯逊; 白国平; 曹斌风; 金凤鸣",null,"白国平","地球科学学院",null,"中国石油大学(北京)","深层碎屑岩含油气储层发育特征","2016","38","01","1-10","国家重大科技专项(2011ZX05006-005);国土资源部科技项目(2015YQKYQ0401)","A"]
["地球物理学报","曹环宇","学生","曹环宇; 朱传庆; 邱楠生",null,"朱传庆","地球科学学院",null,"中国石油大学(北京)","川东地区古生界主要泥页岩最高古温度特征","2016","59","03","1017-1029","国家重点基础研究发展计划(973)项目(2012CB214703)、国家自然科学基金项目(41125010)与中国石油科技创新基金项目(2013D-5006-0102)联合资助.","A"]
["天然气地球科学","向才富","教师","向才富;王绪龙;魏立春;李剑;梁天超;廖建德",null,"向才富","地球科学学院",null,"中国石油大学(北京)","准噶尔盆地克拉美丽气田天然气成因与运聚路径","2016","27","02","268-277","国家重点基础研究计划(“973”)项目(编号:2006CB202308;2011CB201100);国家科技重大专项(编号:2011ZX05007-002);国家自然科学基金项目(编号:40872097;41272161);中国石油大学油气资源与探测国家重点实验室开放基金(编号:KYJJ2012-01-12)联合资助.","A"]
["古地理学报","王大鹏","学生","王大鹏;白国平;徐艳;陈小亮;陶崇智;张明亮",null,"白国平","地球科学学院",null,"中国石油大学(北京)","全球古生界海相碳酸盐岩大油气田特征及油气分布","2016","18","01","80-92","国家科技重大专项(编号:2011ZX05005-001)资助.[Financially supported by the National Science and Technology Major Project (No.2011ZX05005-001)]","A"]
["石油学报","张凯逊","学生","张凯逊; 白国平; 金凤鸣; 王权",null,"白国平","地球科学学院",null,"中国石油大学(北京)","层序地层格架内成岩作用——以饶阳凹陷中南部沙河街组三段砂岩为例","2016","37","06","728-742","国家油气重大科技专项(2011ZX05006-005)和国土资源部油气中心科技项目(2015YQKYQ0401)资助.","A"]
["新疆石油地质","乔锦琪","学生","乔锦琪; 刘洛夫; 申宝剑; 胡青",null,"刘洛夫","地球科学学院",null,"中国石油大学(北京)","塔里木盆地奥陶系页岩气形成条件及有利区带预测","2016","37","04","409-416","国家自然科学基金(41372143);国家科技重大专项(2011ZX05003-001)","A"]
["天然气地球科学","万青青","学生","万青青;刘洛夫;肖飞;常敏;吴雅君;胡青",null,"刘洛夫","地球科学学院",null,"中国石油大学(北京)","准噶尔盆地车排子地区下白垩统清水河组储层成岩作用及物性影响因素","2016","27","07","1264-1276","国家科技重大专项(编号:2011ZX05003-001);国家自然科学基金(编号:41372143)联合资助．","A"]
["岩性油气藏","郭颖","学生","郭颖; 汤良杰; 倪金龙",null,"汤良杰","地球科学学院",null,"中国石油大学(北京)","碎屑岩地层压实规律及其在古构造恢复中的应用","2016","28","04","43-50","国家自然科学基金项目“塔里木盆地塔中隆起和塔中北坡走滑构造差异变形机理与油气聚集”(编号:41572105)和山东省自然科学基金项目“济阳坳陷惠民—东营凹陷中央隆起带差异隆升机制研究”(编号:ZR2013DM007)联合资助","A"]
["大地构造与成矿学","郭颖","学生","郭颖;汤良杰;余腾孝;田亚杰;岳勇;陈刚;龙禹",null,"汤良杰","地球科学学院",null,"中国石油大学(北京)","塔里木盆地塘古巴斯坳陷玛东构造带断裂特征及成因探讨","2016","40","04","643-653","国家自然科学基金项目(41572105,41172125)、国家重点基础研究发展计划973项目(2012CB214804)、国家科技重大专项(2011ZX05002-003-001)和中国石油化工股份有限公司项目(P14131, P11086)联合资助。","A"]
["成都理工大学学报（自然科学版）","冯旭","学生","冯旭;刘洛夫;窦文超;万青青;徐正建;吉海涛",null,"刘洛夫","地球科学学院",null,"中国石油大学(北京)","鄂尔多斯盆地西南部长7和长6-3致密砂岩成岩作用与成岩相","2016","43","04","476-486","国家自然科学基金(41372143)及教育部高等学校博士学科点专项科研基金(20130007110002)联合资助.","A"]
["天然气地球科学","刘一锋","学生","刘一锋; 邱楠生; 谢增业; 姚倩颖; 刘雯",null,"邱楠生","地球科学学院",null,"中国石油大学(北京)","川中古隆起寒武系超压形成与保存","2016","27","08","1439-1446","国家“973”项目(编号:2012CB214703);国家杰出青年基金项目“石油与天然气地质”(编号:41125010);国家科技重大专项研究专题“典型大气田形成的温压条件研究”(编号:2011ZX05007-002)联合资助.","A"]
["矿物岩石地球化学通报","乔锦琪","学生","乔锦琪; 刘洛夫; 尚晓庆; 李博一",null,"刘洛夫","地球科学学院",null,"中国石油大学(北京)","泥页岩中微量元素V、Ni、V/Ni与有机质丰度及成岩演化关系研究——以准噶尔盆地阜康凹陷为例","2016","35","04","756-768","","A"]
["矿物岩石地球化学通报","吕修祥","教师","吕修祥; 张艳萍; 敬兵;张春林",null,"吕修祥","地球科学学院",null,"中国石油大学(北京)","走滑断层弯曲破碎带特征及对深部岩溶储集层发育的控制作用","2016","35","05","839-850","国家科技重大专项（2011 ZX05008-003）；国家自然科学基金项目（41372146）","A"]
{"$rows_left_out":869}
{"sheet":"Sheet2","index":1,"n_rows":0,"n_cols":0,"rows_kept":0}

{"sheet":"Sheet3","index":2,"n_rows":0,"n_cols":0,"rows_kept":0}